{"text_format":"1","workbook":"xlsx","n_sheets":4,"sheets":["Long Course","Short Course","TempLC","TempSC"],"not_rendered":{"charts":0,"images":0,"macros":0,"external_links":1,"defined_names":5,"comments":0,"pivot_tables":0},"unopened":[],"bounds":{"document_bytes":16777216,"sheet_cells":100000,"rows_first":2000,"rows_last":500,"rows_between":2000,"halvings":0,"cell_chars":16384,"cell_head_chars":4096},"cells_cut":0,"cells_raw":0,"read":"whole","date_system":"1900"}

{"sheet":"Long Course","index":0,"n_rows":90,"n_cols":13,"rows_kept":90,"cut":false,"hidden":false,"merged":[[0,0,0,9],[1,0,1,9],[2,0,2,9],[3,0,3,9]]}
["Bendigo Triathlon Club"]
["Villawood Summer Series 2011-12"]
["Long Course Aggregate Points"]
["Best 6 results are used for the final tally"]
["Name","Mem No","Sep","Oct","Nov","Dec","Jan","Feb","Mar","Total","Count","Points to drop","Final Points"]
["Ian Frost",240,15,12,20,11,16,18,3,{"$f":"SUM(C6:I6)","v":95},{"$f":"COUNT(C6:I6)","v":7},{"$f":"IF(K6=7,MIN(C6:I6),\"\")","v":3},{"$f":"J6-L6","v":92}]
["Reagan Stroud",259,16,9,17,16,11,null,8,{"$f":"SUM(C7:I7)","v":77},{"$f":"COUNT(C7:I7)","v":6},{"$f":"IF(K7=7,MIN(C7:I7),\"0\")","v":"0"},{"$f":"J7-L7","v":77}]
["Georgina Lanyon",241,18,null,19,null,13,15,11,{"$f":"SUM(C8:I8)","v":76},{"$f":"COUNT(C8:I8)","v":5},{"$f":"IF(K8=7,MIN(C8:I8),\"0\")","v":"0"},{"$f":"J8-L8","v":76}]
["Megan Goode",157,null,11,18,null,8,19,6,{"$f":"SUM(C9:I9)","v":62},{"$f":"COUNT(C9:I9)","v":5},{"$f":"IF(K9=7,MIN(C9:I9),\"0\")","v":"0"},{"$f":"J9-L9","v":62}]
["Tony Vlaeminck",99,null,13,16,null,null,20,10,{"$f":"SUM(C10:I10)","v":59},{"$f":"COUNT(C10:I10)","v":4},{"$f":"IF(K10=7,MIN(C10:I10),\"0\")","v":"0"},{"$f":"J10-L10","v":59}]
["Jayson Burhop",78,12,null,null,6,12,10,17,{"$f":"SUM(C11:I11)","v":57},{"$f":"COUNT(C11:I11)","v":5},{"$f":"IF(K11=7,MIN(C11:I11),\"0\")","v":"0"},{"$f":"J11-L11","v":57}]
["Russell Weekley",50,1,10,null,19,15,null,12,{"$f":"SUM(C12:I12)","v":57},{"$f":"COUNT(C12:I12)","v":5},{"$f":"IF(K12=7,MIN(C12:I12),\"0\")","v":"0"},{"$f":"J12-L12","v":57}]
["Alison Cartner",14,8,15,12,14,3,3,1,{"$f":"SUM(C13:I13)","v":56},{"$f":"COUNT(C13:I13)","v":7},{"$f":"IF(K13=7,MIN(C13:I13),\"0\")","v":1},{"$f":"J13-L13","v":55}]
["Fraser Walsh",79,11,18,null,null,7,13,1,{"$f":"SUM(C14:I14)","v":50},{"$f":"COUNT(C14:I14)","v":5},{"$f":"IF(K14=7,MIN(C14:I14),\"0\")","v":"0"},{"$f":"J14-L14","v":50}]
["Liz Foster",67,null,16,9,null,20,null,1,{"$f":"SUM(C15:I15)","v":46},{"$f":"COUNT(C15:I15)","v":4},{"$f":"IF(K15=7,MIN(C15:I15),\"0\")","v":"0"},{"$f":"J15-L15","v":46}]
["Damian Hughes",245,10,17,null,17,null,null,1,{"$f":"SUM(C16:I16)","v":45},{"$f":"COUNT(C16:I16)","v":4},{"$f":"IF(K16=7,MIN(C16:I16),\"0\")","v":"0"},{"$f":"J16-L16","v":45}]
["Kylie Howlett",176,1,19,1,5,18,null,null,{"$f":"SUM(C17:I17)","v":44},{"$f":"COUNT(C17:I17)","v":5},{"$f":"IF(K17=7,MIN(C17:I17),\"0\")","v":"0"},{"$f":"J17-L17","v":44}]
["Bronwyn Morris",47,null,8,11,7,5,7,5,{"$f":"SUM(C18:I18)","v":43},{"$f":"COUNT(C18:I18)","v":6},{"$f":"IF(K18=7,MIN(C18:I18),\"0\")","v":"0"},{"$f":"J18-L18","v":43}]
["Michael Hogan",204,9,null,null,15,17,null,2,{"$f":"SUM(C19:I19)","v":43},{"$f":"COUNT(C19:I19)","v":4},{"$f":"IF(K19=7,MIN(C19:I19),\"0\")","v":"0"},{"$f":"J19-L19","v":43}]
["Ben Fahy",238,null,null,null,13,null,9,18,{"$f":"SUM(C20:I20)","v":40},{"$f":"COUNT(C20:I20)","v":3},{"$f":"IF(K20=7,MIN(C20:I20),\"0\")","v":"0"},{"$f":"J20-L20","v":40}]
["Kevin Walsh",94,19,null,13,null,4,null,null,{"$f":"SUM(C21:I21)","v":36},{"$f":"COUNT(C21:I21)","v":3},{"$f":"IF(K21=7,MIN(C21:I21),\"0\")","v":"0"},{"$f":"J21-L21","v":36}]
["Todd Foster",66,null,null,null,18,2,null,15,{"$f":"SUM(C22:I22)","v":35},{"$f":"COUNT(C22:I22)","v":3},{"$f":"IF(K22=7,MIN(C22:I22),\"0\")","v":"0"},{"$f":"J22-L22","v":35}]
["Karl Lanyon",243,null,null,null,null,19,16,null,{"$f":"SUM(C23:I23)","v":35},{"$f":"COUNT(C23:I23)","v":2},{"$f":"IF(K23=7,MIN(C23:I23),\"0\")","v":"0"},{"$f":"J23-L23","v":35}]
["Jarrod Draper",234,20,14,null,null,null,null,null,{"$f":"SUM(C24:I24)","v":34},{"$f":"COUNT(C24:I24)","v":2},{"$f":"IF(K24=7,MIN(C24:I24),\"0\")","v":"0"},{"$f":"J24-L24","v":34}]
["Jarrod Epps",51,13,null,15,null,null,null,4,{"$f":"SUM(C25:I25)","v":32},{"$f":"COUNT(C25:I25)","v":3},{"$f":"IF(K25=7,MIN(C25:I25),\"0\")","v":"0"},{"$f":"J25-L25","v":32}]
["Geoffrey Graham",56,null,null,null,null,14,17,1,{"$f":"SUM(C26:I26)","v":32},{"$f":"COUNT(C26:I26)","v":3},{"$f":"IF(K26=7,MIN(C26:I26),\"0\")","v":"0"},{"$f":"J26-L26","v":32}]
["Steve Monigatti",184,6,null,14,10,1,null,1,{"$f":"SUM(C27:I27)","v":32},{"$f":"COUNT(C27:I27)","v":5},{"$f":"IF(K27=7,MIN(C27:I27),\"0\")","v":"0"},{"$f":"J27-L27","v":32}]
["Bryce Fitzpatrick",71,null,20,null,null,10,null,null,{"$f":"SUM(C28:I28)","v":30},{"$f":"COUNT(C28:I28)","v":2},{"$f":"IF(K28=7,MIN(C28:I28),\"0\")","v":"0"},{"$f":"J28-L28","v":30}]
["Kim Townrow",127,null,null,7,9,null,null,13,{"$f":"SUM(C29:I29)","v":29},{"$f":"COUNT(C29:I29)","v":3},{"$f":"IF(K29=7,MIN(C29:I29),\"0\")","v":"0"},{"$f":"J29-L29","v":29}]
["Tim Lovell",212,null,null,null,20,null,1,7,{"$f":"SUM(C30:I30)","v":28},{"$f":"COUNT(C30:I30)","v":3},{"$f":"IF(K30=7,MIN(C30:I30),\"0\")","v":"0"},{"$f":"J30-L30","v":28}]
["Gavin Fiedler",1,4,7,2,8,6,1,null,{"$f":"SUM(C31:I31)","v":28},{"$f":"COUNT(C31:I31)","v":6},{"$f":"IF(K31=7,MIN(C31:I31),\"0\")","v":"0"},{"$f":"J31-L31","v":28}]
["Melissa Wade",148,1,6,8,12,null,null,null,{"$f":"SUM(C32:I32)","v":27},{"$f":"COUNT(C32:I32)","v":4},{"$f":"IF(K32=7,MIN(C32:I32),\"0\")","v":"0"},{"$f":"J32-L32","v":27}]
["Nick Gillingham",156,null,null,null,null,1,null,20,{"$f":"SUM(C33:I33)","v":21},{"$f":"COUNT(C33:I33)","v":2},{"$f":"IF(K33=7,MIN(C33:I33),\"0\")","v":"0"},{"$f":"J33-L33","v":21}]
["Russell Tremayne",45,null,null,null,null,null,12,9,{"$f":"SUM(C34:I34)","v":21},{"$f":"COUNT(C34:I34)","v":2},{"$f":"IF(K34=7,MIN(C34:I34),\"0\")","v":"0"},{"$f":"J34-L34","v":21}]
["Jac Tremayne",52,null,null,null,null,null,null,19,{"$f":"SUM(C35:I35)","v":19},{"$f":"COUNT(C35:I35)","v":1},{"$f":"IF(K35=7,MIN(C35:I35),\"0\")","v":"0"},{"$f":"J35-L35","v":19}]
["Nicholas Tripodi",117,null,null,null,null,1,1,16,{"$f":"SUM(C36:I36)","v":18},{"$f":"COUNT(C36:I36)","v":3},{"$f":"IF(K36=7,MIN(C36:I36),\"0\")","v":"0"},{"$f":"J36-L36","v":18}]
["Rick Jackel",12,17,null,null,1,null,null,null,{"$f":"SUM(C37:I37)","v":18},{"$f":"COUNT(C37:I37)","v":2},{"$f":"IF(K37=7,MIN(C37:I37),\"0\")","v":"0"},{"$f":"J37-L37","v":18}]
["Kristen Healy",35,null,null,null,1,1,14,1,{"$f":"SUM(C38:I38)","v":17},{"$f":"COUNT(C38:I38)","v":4},{"$f":"IF(K38=7,MIN(C38:I38),\"0\")","v":"0"},{"$f":"J38-L38","v":17}]
["Brad Hinton",216,null,null,null,null,null,null,14,{"$f":"SUM(C39:I39)","v":14},{"$f":"COUNT(C39:I39)","v":1},{"$f":"IF(K39=7,MIN(C39:I39),\"0\")","v":"0"},{"$f":"J39-L39","v":14}]
["Todd Cody",89,14,null,null,null,null,null,null,{"$f":"SUM(C40:I40)","v":14},{"$f":"COUNT(C40:I40)","v":1},{"$f":"IF(K40=7,MIN(C40:I40),\"0\")","v":"0"},{"$f":"J40-L40","v":14}]
{"$rows_left_out":51}
{"sheet":"Short Course","index":1,"n_rows":79,"n_cols":13,"rows_kept":79,"cut":false,"hidden":false,"merged":[[0,0,0,9],[1,0,1,9],[2,0,2,9],[3,0,3,9]]}
["Bendigo Triathlon Club"]
["Villawood Summer Series 2011-12"]
["Short Course Aggregate Points"]
["Best 6 results are used for the final tally"]
[" Name","Mem No","Sep","Oct","Nov","Dec","Jan","Feb","Mar","Total","Count","Points to drop","Final Points"]
["Nathan Green",239,19,13,18,null,20,15,15,{"$f":"SUM(C6:I6)","v":100},{"$f":"COUNT(C6:I6)","v":6},{"$f":"IF(K6=7,MIN(C6:I6),\"0\")","v":"0"},{"$f":"J6-L6","v":100}]
["Matthew Heislers",260,16,1,17,9,null,20,12,{"$f":"SUM(C7:I7)","v":75},{"$f":"COUNT(C7:I7)","v":6},{"$f":"IF(K7=7,MIN(C7:I7),\"0\")","v":"0"},{"$f":"J7-L7","v":75}]
["Alexander Evans",136,1,4,11,14,19,13,1,{"$f":"SUM(C8:I8)","v":63},{"$f":"COUNT(C8:I8)","v":7},{"$f":"IF(K8=7,MIN(C8:I8),\"0\")","v":1},{"$f":"J8-L8","v":62}]
["Laura Terry",131,14,16,12,null,null,9,8,{"$f":"SUM(C9:I9)","v":59},{"$f":"COUNT(C9:I9)","v":5},{"$f":"IF(K9=7,MIN(C9:I9),\"0\")","v":"0"},{"$f":"J9-L9","v":59}]
["David Heislers",261,1,18,6,1,null,14,17,{"$f":"SUM(C10:I10)","v":57},{"$f":"COUNT(C10:I10)","v":6},{"$f":"IF(K10=7,MIN(C10:I10),\"0\")","v":"0"},{"$f":"J10-L10","v":57}]
["Karl Lanyon",243,11,15,15,15,null,null,null,{"$f":"SUM(C11:I11)","v":56},{"$f":"COUNT(C11:I11)","v":4},{"$f":"IF(K11=7,MIN(C11:I11),\"0\")","v":"0"},{"$f":"J11-L11","v":56}]
["Sharon Baker",149,1,null,7,1,18,19,5,{"$f":"SUM(C12:I12)","v":51},{"$f":"COUNT(C12:I12)","v":6},{"$f":"IF(K12=7,MIN(C12:I12),\"0\")","v":"0"},{"$f":"J12-L12","v":51}]
["Samantha Borserio",191,1,9,1,6,17,null,14,{"$f":"SUM(C13:I13)","v":48},{"$f":"COUNT(C13:I13)","v":6},{"$f":"IF(K13=7,MIN(C13:I13),\"0\")","v":"0"},{"$f":"J13-L13","v":48}]
["Damien Bilsborow",54,1,14,14,16,null,null,3,{"$f":"SUM(C14:I14)","v":48},{"$f":"COUNT(C14:I14)","v":5},{"$f":"IF(K14=7,MIN(C14:I14),\"0\")","v":"0"},{"$f":"J14-L14","v":48}]
["Chris Richardson",266,null,null,1,10,7,16,11,{"$f":"SUM(C15:I15)","v":45},{"$f":"COUNT(C15:I15)","v":5},{"$f":"IF(K15=7,MIN(C15:I15),\"0\")","v":"0"},{"$f":"J15-L15","v":45}]
["Lucas Casey",160,10,11,3,null,6,12,2,{"$f":"SUM(C16:I16)","v":44},{"$f":"COUNT(C16:I16)","v":6},{"$f":"IF(K16=7,MIN(C16:I16),\"0\")","v":"0"},{"$f":"J16-L16","v":44}]
["Susie Hawke",169,1,17,10,1,14,null,null,{"$f":"SUM(C17:I17)","v":43},{"$f":"COUNT(C17:I17)","v":5},{"$f":"IF(K17=7,MIN(C17:I17),\"0\")","v":"0"},{"$f":"J17-L17","v":43}]
["Holly Hawke",175,null,1,8,1,12,null,19,{"$f":"SUM(C18:I18)","v":41},{"$f":"COUNT(C18:I18)","v":5},{"$f":"IF(K18=7,MIN(C18:I18),\"0\")","v":"0"},{"$f":"J18-L18","v":41}]
["Chris Gray",268,null,null,1,1,15,18,6,{"$f":"SUM(C19:I19)","v":41},{"$f":"COUNT(C19:I19)","v":5},{"$f":"IF(K19=7,MIN(C19:I19),\"0\")","v":"0"},{"$f":"J19-L19","v":41}]
["Adrian Ryan",57,9,7,null,1,16,7,1,{"$f":"SUM(C20:I20)","v":41},{"$f":"COUNT(C20:I20)","v":6},{"$f":"IF(K20=7,MIN(C20:I20),\"0\")","v":"0"},{"$f":"J20-L20","v":41}]
["Nicholas Cherry",257,null,3,1,5,8,11,9,{"$f":"SUM(C21:I21)","v":37},{"$f":"COUNT(C21:I21)","v":6},{"$f":"IF(K21=7,MIN(C21:I21),\"0\")","v":"0"},{"$f":"J21-L21","v":37}]
["Chris Chiappazzo",123,17,null,null,1,null,null,18,{"$f":"SUM(C22:I22)","v":36},{"$f":"COUNT(C22:I22)","v":3},{"$f":"IF(K22=7,MIN(C22:I22),\"0\")","v":"0"},{"$f":"J22-L22","v":36}]
["Greg Payne",17,null,1,5,12,null,3,13,{"$f":"SUM(C23:I23)","v":34},{"$f":"COUNT(C23:I23)","v":5},{"$f":"IF(K23=7,MIN(C23:I23),\"0\")","v":"0"},{"$f":"J23-L23","v":34}]
["Harry Terry",206,15,6,null,13,null,null,null,{"$f":"SUM(C24:I24)","v":34},{"$f":"COUNT(C24:I24)","v":3},{"$f":"IF(K24=7,MIN(C24:I24),\"0\")","v":"0"},{"$f":"J24-L24","v":34}]
["Luke Crameri",270,null,null,1,19,11,1,null,{"$f":"SUM(C25:I25)","v":32},{"$f":"COUNT(C25:I25)","v":4},{"$f":"IF(K25=7,MIN(C25:I25),\"0\")","v":"0"},{"$f":"J25-L25","v":32}]
["Andrew Wilkie",32,1,null,19,11,null,null,null,{"$f":"SUM(C26:I26)","v":31},{"$f":"COUNT(C26:I26)","v":3},{"$f":"IF(K26=7,MIN(C26:I26),\"0\")","v":"0"},{"$f":"J26-L26","v":31}]
["Kane Watts",80,null,1,1,18,10,null,null,{"$f":"SUM(C27:I27)","v":30},{"$f":"COUNT(C27:I27)","v":4},{"$f":"IF(K27=7,MIN(C27:I27),\"0\")","v":"0"},{"$f":"J27-L27","v":30}]
["Lachlan Cherry",258,18,1,1,7,1,1,1,{"$f":"SUM(C28:I28)","v":30},{"$f":"COUNT(C28:I28)","v":7},{"$f":"IF(K28=7,MIN(C28:I28),\"0\")","v":1},{"$f":"J28-L28","v":29}]
["Riley Walsh",263,null,20,null,1,1,2,4,{"$f":"SUM(C29:I29)","v":28},{"$f":"COUNT(C29:I29)","v":5},{"$f":"IF(K29=7,MIN(C29:I29),\"0\")","v":"0"},{"$f":"J29-L29","v":28}]
["Kyle Gellatly",264,null,19,1,2,null,5,1,{"$f":"SUM(C30:I30)","v":28},{"$f":"COUNT(C30:I30)","v":5},{"$f":"IF(K30=7,MIN(C30:I30),\"0\")","v":"0"},{"$f":"J30-L30","v":28}]
["Andrew Meyers",101,12,null,16,null,null,null,null,{"$f":"SUM(C31:I31)","v":28},{"$f":"COUNT(C31:I31)","v":2},{"$f":"IF(K31=7,MIN(C31:I31),\"0\")","v":"0"},{"$f":"J31-L31","v":28}]
["Madelaine Hawke",174,null,1,1,1,1,null,20,{"$f":"SUM(C32:I32)","v":24},{"$f":"COUNT(C32:I32)","v":5},{"$f":"IF(K32=7,MIN(C32:I32),\"0\")","v":"0"},{"$f":"J32-L32","v":24}]
["Adam Graham",76,8,12,null,1,null,null,1,{"$f":"SUM(C33:I33)","v":22},{"$f":"COUNT(C33:I33)","v":4},{"$f":"IF(K33=7,MIN(C33:I33),\"0\")","v":"0"},{"$f":"J33-L33","v":22}]
["Mark Lees",196,null,1,null,20,null,null,null,{"$f":"SUM(C34:I34)","v":21},{"$f":"COUNT(C34:I34)","v":2},{"$f":"IF(K34=7,MIN(C34:I34),\"0\")","v":"0"},{"$f":"J34-L34","v":21}]
["Janine Andrews",83,20,null,null,null,null,null,null,{"$f":"SUM(C35:I35)","v":20},{"$f":"COUNT(C35:I35)","v":1},{"$f":"IF(K35=7,MIN(C35:I35),\"0\")","v":"0"},{"$f":"J35-L35","v":20}]
["Matt Smith",26,1,10,9,null,null,null,null,{"$f":"SUM(C36:I36)","v":20},{"$f":"COUNT(C36:I36)","v":3},{"$f":"IF(K36=7,MIN(C36:I36),\"0\")","v":"0"},{"$f":"J36-L36","v":20}]
["Tim Lovell",212,null,null,20,null,null,null,null,{"$f":"SUM(C37:I37)","v":20},{"$f":"COUNT(C37:I37)","v":1},{"$f":"IF(K37=7,MIN(C37:I37),\"0\")","v":"0"},{"$f":"J37-L37","v":20}]
["Mal Grimes",273,null,null,1,null,null,17,1,{"$f":"SUM(C38:I38)","v":19},{"$f":"COUNT(C38:I38)","v":3},{"$f":"IF(K38=7,MIN(C38:I38),\"0\")","v":"0"},{"$f":"J38-L38","v":19}]
["Johnny Maher",138,null,null,1,8,9,null,null,{"$f":"SUM(C39:I39)","v":18},{"$f":"COUNT(C39:I39)","v":3},{"$f":"IF(K39=7,MIN(C39:I39),\"0\")","v":"0"},{"$f":"J39-L39","v":18}]
["Dylan Ferguson",112,null,null,null,null,null,1,16,{"$f":"SUM(C40:I40)","v":17},{"$f":"COUNT(C40:I40)","v":2},{"$f":"IF(K40=7,MIN(C40:I40),\"0\")","v":"0"},{"$f":"J40-L40","v":17}]
{"$rows_left_out":40}
{"sheet":"TempLC","index":2,"n_rows":61,"n_cols":6,"rows_kept":61,"cut":false,"hidden":false,"merged":[[4,0,4,4],[0,0,0,4],[1,0,1,4],[2,0,2,4],[3,0,3,4]]}
["Bendigo Triathlon Club"]
["Villawood Summer Series"]
["Long Course"]
[{"$f":"[1]Menu!B3","v":"2012-03-17"}]
["Handicap Results"]
[]
["Name","Bib No","Race Time","Handicap","Adjusted Time"]
["Nick Gillingham",156,"1:08:02.0",{"$f":"VLOOKUP(A8,'[1]Long Course Handicaps'!$C$2:$F$300,4,FALSE)","v":"00:24:36.825"},{"$f":"IF(ISERROR(D8),\"0\",C8+D8)","v":"01:32:38.825"},20]
["Jac Tremayne",52,"1:14:30.0",{"$f":"VLOOKUP(A9,'[1]Long Course Handicaps'!$C$2:$F$300,4,FALSE)","v":"00:21:57.987"},"01:36:27.987",19]
["Ben Fahy",238,"59:06.5",{"$f":"VLOOKUP(A10,'[1]Long Course Handicaps'!$C$2:$F$300,4,FALSE)","v":"00:38:34.420"},"01:37:40.920",18]
["Jayson Burhop",78,"1:04:31.1",{"$f":"VLOOKUP(A11,'[1]Long Course Handicaps'!$C$2:$F$300,4,FALSE)","v":"00:33:16.624"},"01:37:47.724",17]
["Nicholas Tripodi",117,"1:08:10.6",{"$f":"VLOOKUP(A12,'[1]Long Course Handicaps'!$C$2:$F$300,4,FALSE)","v":"00:29:39.586"},"01:37:50.186",16]
["Todd Foster",66,"1:09:23.4",{"$f":"VLOOKUP(A13,'[1]Long Course Handicaps'!$C$2:$F$300,4,FALSE)","v":"00:28:26.836"},"01:37:50.236",15]
["Brad Hinton",216,"1:10:02.7",{"$f":"VLOOKUP(A14,'[1]Long Course Handicaps'!$C$2:$F$300,4,FALSE)","v":"00:27:51.431"},"01:37:54.131",14]
["Kim Townrow",127,"1:10:05.3",{"$f":"VLOOKUP(A15,'[1]Long Course Handicaps'!$C$2:$F$300,4,FALSE)","v":"00:27:49.613"},"01:37:54.913",13]
["Russell Weekley",290,"59:24.9",{"$f":"VLOOKUP(A16,'[1]Long Course Handicaps'!$C$2:$F$300,4,FALSE)","v":"00:38:32.116"},"01:37:57.016",12]
["Georgina Lanyon",241,"1:09:53.0",{"$f":"VLOOKUP(A17,'[1]Long Course Handicaps'!$C$2:$F$300,4,FALSE)","v":"00:28:18.227"},"01:38:11.227",11]
["Tony Vlaeminck",99,"1:03:56.7",{"$f":"VLOOKUP(A18,'[1]Long Course Handicaps'!$C$2:$F$300,4,FALSE)","v":"00:34:23.675"},"01:38:20.375",10]
["Russell Tremayne",45,"1:05:51.5",{"$f":"VLOOKUP(A19,'[1]Long Course Handicaps'!$C$2:$F$300,4,FALSE)","v":"00:32:36.732"},"01:38:28.232",9]
["Reagan Stroud",259,"1:02:01.1",{"$f":"VLOOKUP(A20,'[1]Long Course Handicaps'!$C$2:$F$300,4,FALSE)","v":"00:36:31.472"},"01:38:32.572",8]
["Tim Lovell",212,"1:12:49.6",{"$f":"VLOOKUP(A21,'[1]Long Course Handicaps'!$C$2:$F$300,4,FALSE)","v":"00:25:54.789"},"01:38:44.389",7]
["Megan Goode",157,"1:15:44.6",{"$f":"VLOOKUP(A22,'[1]Long Course Handicaps'!$C$2:$F$300,4,FALSE)","v":"00:23:04.069"},"01:38:48.669",6]
["Bronwyn Morris",47,"1:13:25.1",{"$f":"VLOOKUP(A23,'[1]Long Course Handicaps'!$C$2:$F$300,4,FALSE)","v":"00:25:23.749"},"01:38:48.849",5]
["Jarrod Epps",51,"1:01:13.8",{"$f":"VLOOKUP(A24,'[1]Long Course Handicaps'!$C$2:$F$300,4,FALSE)","v":"00:37:41.434"},"01:38:55.234",4]
["Ian Frost",240,"1:07:21.8",{"$f":"VLOOKUP(A25,'[1]Long Course Handicaps'!$C$2:$F$300,4,FALSE)","v":"00:31:33.925"},"01:38:55.725",3]
["Michael Hogan",204,"1:13:55.3",{"$f":"VLOOKUP(A26,'[1]Long Course Handicaps'!$C$2:$F$300,4,FALSE)","v":"00:25:13.200"},"01:39:08.500",2]
["Jarrod Brown",250,"1:13:18.7",{"$f":"VLOOKUP(A27,'[1]Long Course Handicaps'!$C$2:$F$300,4,FALSE)","v":"00:25:50.302"},"01:39:09.002",1]
["Geoffrey Graham",56,"1:12:03.9",{"$f":"VLOOKUP(A28,'[1]Long Course Handicaps'!$C$2:$F$300,4,FALSE)","v":"00:27:25.969"},"01:39:29.869",1]
["Evan Barr",126,"1:04:58.5",{"$f":"VLOOKUP(A29,'[1]Long Course Handicaps'!$C$2:$F$300,4,FALSE)","v":"00:34:45.136"},"01:39:43.636",1]
["Fraser Walsh",79,"1:00:00.5",{"$f":"VLOOKUP(A30,'[1]Long Course Handicaps'!$C$2:$F$300,4,FALSE)","v":"00:39:46.079"},"01:39:46.579",1]
["Scott Alterator",405,"1:06:28.4",{"$f":"VLOOKUP(A31,'[1]Long Course Handicaps'!$C$2:$F$300,4,FALSE)","v":"00:33:25.475"},"01:39:53.875",1]
["Steve Monigatti",184,"1:09:48.6",{"$f":"VLOOKUP(A32,'[1]Long Course Handicaps'!$C$2:$F$300,4,FALSE)","v":"00:30:10.505"},"01:39:59.105",1]
["Alison Cartner",14,"1:14:20.8",{"$f":"VLOOKUP(A33,'[1]Long Course Handicaps'!$C$2:$F$300,4,FALSE)","v":"00:25:46.544"},"01:40:07.344",1]
["Andrew Wilkie",32,"1:10:31.7",{"$f":"VLOOKUP(A34,'[1]Long Course Handicaps'!$C$2:$F$300,4,FALSE)","v":"00:29:40.920"},"01:40:12.620",1]
["Andrew Meyers",101,"1:14:07.0",{"$f":"VLOOKUP(A35,'[1]Long Course Handicaps'!$C$2:$F$300,4,FALSE)","v":"00:26:16.250"},"01:40:23.250",1]
["Anthony Mellors",75,"1:07:03.9",{"$f":"VLOOKUP(A36,'[1]Long Course Handicaps'!$C$2:$F$300,4,FALSE)","v":"00:33:21.837"},"01:40:25.737",1]
["Matt Smith",26,"1:11:59.4",{"$f":"VLOOKUP(A37,'[1]Long Course Handicaps'!$C$2:$F$300,4,FALSE)","v":"00:28:46.479"},"01:40:45.879",1]
["Liz Foster",67,"1:15:37.4",{"$f":"VLOOKUP(A38,'[1]Long Course Handicaps'!$C$2:$F$300,4,FALSE)","v":"00:25:32.236"},"01:41:09.636",1]
["Therese Martin",16,"1:14:47.8",{"$f":"VLOOKUP(A39,'[1]Long Course Handicaps'!$C$2:$F$300,4,FALSE)","v":"00:26:33.225"},"01:41:21.025",1]
["Mark Lees",196,"1:14:53.5",{"$f":"VLOOKUP(A40,'[1]Long Course Handicaps'!$C$2:$F$300,4,FALSE)","v":"00:26:41.712"},"01:41:35.212",1]
{"$rows_left_out":22}
{"sheet":"TempSC","index":3,"n_rows":54,"n_cols":6,"rows_kept":54,"cut":false,"hidden":false,"merged":[[4,0,4,4],[0,0,0,4],[1,0,1,4],[2,0,2,4],[3,0,3,4]]}
["Bendigo Triathlon Club"]
["Villawood Summer Series"]
["Short Course"]
[{"$f":"[1]Menu!B3","v":"2012-03-17"}]
["Handicap Results"]
[]
["Name","Bib No","Race Time","Handicap","Adjusted Time"]
["Madelaine Hawke",174,"37:46.9",{"$f":"VLOOKUP(A8,'[1]Short Course Handicaps'!$C$2:$F$300,4,FALSE)","v":"00:04:30.145"},{"$f":"IF(ISERROR(D8),\"0\",C8+D8)","v":"00:42:17.045"},20]
["Holly Hawke",175,"31:58.4",{"$f":"VLOOKUP(A9,'[1]Short Course Handicaps'!$C$2:$F$300,4,FALSE)","v":"00:10:37.387"},"00:42:35.787",19]
["Chris Chiappazzo",123,"30:00.5",{"$f":"VLOOKUP(A10,'[1]Short Course Handicaps'!$C$2:$F$300,4,FALSE)","v":"00:13:59.632"},"00:44:00.132",18]
["David Heislers",261,"35:41.2",{"$f":"VLOOKUP(A11,'[1]Short Course Handicaps'!$C$2:$F$300,4,FALSE)","v":"00:08:21.102"},"00:44:02.302",17]
["Dylan Ferguson",112,"29:29.4",{"$f":"VLOOKUP(A12,'[1]Short Course Handicaps'!$C$2:$F$300,4,FALSE)","v":"00:14:35.910"},"00:44:05.310",16]
["Nathan Green",239,"30:47.4",{"$f":"VLOOKUP(A13,'[1]Short Course Handicaps'!$C$2:$F$300,4,FALSE)","v":"00:13:18.407"},"00:44:05.807",15]
["Samantha Borserio",191,"32:54.7",{"$f":"VLOOKUP(A14,'[1]Short Course Handicaps'!$C$2:$F$300,4,FALSE)","v":"00:11:11.337"},"00:44:06.037",14]
["Greg Payne",17,"30:54.1",{"$f":"VLOOKUP(A15,'[1]Short Course Handicaps'!$C$2:$F$300,4,FALSE)","v":"00:13:23.839"},"00:44:17.939",13]
["Matthew Heislers",260,"30:01.3",{"$f":"VLOOKUP(A16,'[1]Short Course Handicaps'!$C$2:$F$300,4,FALSE)","v":"00:14:26.695"},"00:44:27.995",12]
["Chris Richardson",296,"34:22.1",{"$f":"VLOOKUP(A17,'[1]Short Course Handicaps'!$C$2:$F$300,4,FALSE)","v":"00:10:14.107"},"00:44:36.207",11]
["Carolyn Wiseman",272,"37:51.0",{"$f":"VLOOKUP(A18,'[1]Short Course Handicaps'!$C$2:$F$300,4,FALSE)","v":"00:07:00.786"},"00:44:51.786",10]
["Nicholas Cherry",257,"30:07.0",{"$f":"VLOOKUP(A19,'[1]Short Course Handicaps'!$C$2:$F$300,4,FALSE)","v":"00:14:51.915"},"00:44:58.915",9]
["Laura Terry",131,"36:07.1",{"$f":"VLOOKUP(A20,'[1]Short Course Handicaps'!$C$2:$F$300,4,FALSE)","v":"00:08:53.888"},"00:45:00.988",8]
["Melissa Wilkie",33,"35:28.4",{"$f":"VLOOKUP(A21,'[1]Short Course Handicaps'!$C$2:$F$300,4,FALSE)","v":"00:09:40.545"},"00:45:08.945",7]
["Chris Gray",268,"32:30.8",{"$f":"VLOOKUP(A22,'[1]Short Course Handicaps'!$C$2:$F$300,4,FALSE)","v":"00:12:44.263"},"00:45:15.063",6]
["Sharon Baker",149,"31:11.6",{"$f":"VLOOKUP(A23,'[1]Short Course Handicaps'!$C$2:$F$300,4,FALSE)","v":"00:14:05.840"},"00:45:17.440",5]
["Riley Walsh",263,"36:25.5",{"$f":"VLOOKUP(A24,'[1]Short Course Handicaps'!$C$2:$F$300,4,FALSE)","v":"00:08:52.336"},"00:45:17.836",4]
["Damien Bilsborow",54,"29:44.0",{"$f":"VLOOKUP(A25,'[1]Short Course Handicaps'!$C$2:$F$300,4,FALSE)","v":"00:15:34.789"},"00:45:18.789",3]
["Lucas Casey",160,"30:30.0",{"$f":"VLOOKUP(A26,'[1]Short Course Handicaps'!$C$2:$F$300,4,FALSE)","v":"00:14:48.908"},"00:45:18.908",2]
["Adrian Ryan",57,"32:35.3",{"$f":"VLOOKUP(A27,'[1]Short Course Handicaps'!$C$2:$F$300,4,FALSE)","v":"00:13:06.670"},"00:45:41.970",1]
["Kyle Gellatly",264,"34:10.6",{"$f":"VLOOKUP(A28,'[1]Short Course Handicaps'!$C$2:$F$300,4,FALSE)","v":"00:11:35.005"},"00:45:45.605",1]
["Lachlan Cherry",258,"34:17.5",{"$f":"VLOOKUP(A29,'[1]Short Course Handicaps'!$C$2:$F$300,4,FALSE)","v":"00:11:39.467"},"00:45:56.967",1]
["Kim Fairbairn-Baker",269,"34:34.9",{"$f":"VLOOKUP(A30,'[1]Short Course Handicaps'!$C$2:$F$300,4,FALSE)","v":"00:11:24.529"},"00:45:59.429",1]
["Leanne McLeod",275,"40:57.6",{"$f":"VLOOKUP(A31,'[1]Short Course Handicaps'!$C$2:$F$300,4,FALSE)","v":"00:05:34.165"},"00:46:31.765",1]
["Ethan Lees",120,"37:11.7",{"$f":"VLOOKUP(A32,'[1]Short Course Handicaps'!$C$2:$F$300,4,FALSE)","v":"00:09:30.554"},"00:46:42.254",1]
["Alexander Evans",136,"33:11.1",{"$f":"VLOOKUP(A33,'[1]Short Course Handicaps'!$C$2:$F$300,4,FALSE)","v":"00:13:40.426"},"00:46:51.526",1]
["Liam Frye",58,"29:28.5",{"$f":"VLOOKUP(A34,'[1]Short Course Handicaps'!$C$2:$F$300,4,FALSE)","v":"00:17:49.328"},"00:47:17.828",1]
["Adam Graham",280,"39:11.4",{"$f":"VLOOKUP(A35,'[1]Short Course Handicaps'!$C$2:$F$300,4,FALSE)","v":"00:08:27.019"},"00:47:38.419",1]
["Mal Grimes",273,"37:14.7",{"$f":"VLOOKUP(A36,'[1]Short Course Handicaps'!$C$2:$F$300,4,FALSE)","v":"00:11:01.540"},"00:48:16.240",1]
["Kevin Perez",150,"36:20.7",{"$f":"VLOOKUP(A37,'[1]Short Course Handicaps'!$C$2:$F$300,4,FALSE)","v":"00:12:06.530"},"00:48:27.230",1]
["Justin Weeks",420,"29:30.0",{"$f":"VLOOKUP(A38,'[1]Short Course Handicaps'!$C$2:$F$300,4,FALSE)","v":{"$error":"#N/A"}},"0"]
["Shane Verbeek",424,"30:31.5",{"$f":"VLOOKUP(A39,'[1]Short Course Handicaps'!$C$2:$F$300,4,FALSE)","v":{"$error":"#N/A"}},"0"]
["Donna MacCallum",29,"32:07.3",{"$f":"VLOOKUP(A40,'[1]Short Course Handicaps'!$C$2:$F$300,4,FALSE)","v":{"$error":"#N/A"}},"0",1]
{"$rows_left_out":14}